Reaction Details
TargetKappa-type opioid receptor
LigandBDBM50125465
Substrate/Competitorn/a
Meas. Tech.ChEBML_145114
IC50 1760±n/a nM
Citation Semple, GAndersson, BMChhajlani, VGeorgsson, JJohansson, MJRosenquist, ASwanson, L Synthesis and Biological activity of kappa opioid receptor agonists. Part 2: preparation of 3-aryl-2-pyridone analogues generated by solution- and solid-phase parallel synthesis methods. Bioorg Med Chem Lett13:1141-5 (2003) Kappa-type opioid receptor
Name:Kappa-type opioid receptor
Type:G Protein-Coupled Receptor (GPCR)
Mol. Mass.:42648.76
Organism:Homo sapiens (Human)
Description:P41145
Residue:380
BDBM50125465
NameBDBM50125465
Synonyms:5-Phenyl-3-(1-phenyl-2-pyrrolidin-1-yl-ethyl)-3H-pyrimidin-4-one | CHEMBL15027
TypeSmall organic molecule
Emp. Form.C22H23N3O
Mol. Mass.345.4375
SMILESO=c1c(cncn1C(CN1CCCC1)c1ccccc1)-c1ccccc1