Reaction Details
TargetCytochrome P450 1A1
LigandBDBM50562232
Substrate/Competitorn/a
Meas. Tech.ChEMBL_2077758 (CHEMBL4733549)
IC50 6.9±n/a nM
Citation Dong, JHuang, GCui, QMeng, QLi, SCui, J Discovery of heterocycle-containing ?-naphthoflavone derivatives as water-soluble, highly potent and selective CYP1B1 inhibitors. Eur J Med Chem209:0 (2021) 
 
Cytochrome P450 1A1
Name:Cytochrome P450 1A1
Type:Protein
Mol. Mass.:58177.23
Organism:Homo sapiens (Human)
Description:P04798
Residue:512
BDBM50562232
NameBDBM50562232
Synonyms:CHEMBL4791264
TypeSmall organic molecule
Emp. Form.C22H19NO5
Mol. Mass.377.39
SMILESCOc1ccc(OC)c2c3oc(cc(=O)c3cc(OC)c12)-c1cncc(C)c1