Reaction Details
TargetDelta-type opioid receptor
LigandBDBM50126000
Substrate/Competitorn/a
Meas. Tech.ChEBML_146889
Ki 1688±n/a nM
Citation Ambo, ANiizuma, HSasaki, AKohara, HSasaki, Y Dermorphin tetrapeptide analogues with 2',6'-dimethylphenylalanine (Dmp) substituted for aromatic amino acids have high mu opioid receptor binding and biological activities. Bioorg Med Chem Lett13:1269-72 (2003) Delta-type opioid receptor
Name:Delta-type opioid receptor
Type:G Protein-Coupled Receptor (GPCR)
Mol. Mass.:40465.04
Organism:Rattus norvegicus (rat)
Description:Competition binding assays were using CHO-K1 cell membranes expressing the opioid receptor.
Residue:372
BDBM50126000
NameBDBM50126000
Synonyms:(R)-2-[(S)-2-Amino-3-(2,6-dimethyl-phenyl)-propionylamino]-5-guanidino-pentanoic acid [(S)-1-(2-carbamoyl-ethylcarbamoyl)-2-(2,6-dimethyl-phenyl)-ethyl]-amide | CHEMBL24059
TypeSmall organic molecule
Emp. Form.C31H46N8O4
Mol. Mass.594.7481
SMILESCc1cccc(C)c1C[C@H](N)C(=O)N[C@H](CCCNC(N)=N)C(=O)N[C@@H](Cc1c(C)cccc1C)C(=O)NCCC(N)=O