Reaction Details
TargetPeroxisome proliferator-activated receptor gamma
LigandBDBM50126020
Substrate/Competitorn/a
Meas. Tech.ChEMBL_154187 (CHEMBL762736)
EC50 70±n/a nM
Citation Santini, CBerger, GDHan, WMosley, RMacNaul, KBerger, JDoebber, TWu, MMoller, DETolman, RLSahoo, SP Phenylacetic acid derivatives as hPPAR agonists. Bioorg Med Chem Lett13:1277-80 (2003) Peroxisome proliferator-activated receptor gamma
Name:Peroxisome proliferator-activated receptor gamma
Type:Nuclear Receptor
Mol. Mass.:57613.46
Organism:Homo sapiens (Human)
Description:P37231
Residue:505
BDBM50126020
NameBDBM50126020
Synonyms:CHEMBL25710 | {3-Chloro-4-[3-(3-hydroxy-4-propionyl-2-propyl-phenoxy)-propylsulfanyl]-phenyl}-acetic acid
TypeSmall organic molecule
Emp. Form.C23H27ClO5S
Mol. Mass.450.975
SMILESCCCc1c(O)c(ccc1OCCCSc1ccc(CC(O)=O)cc1Cl)C(=O)CC