Reaction Details
TargetPeroxisome proliferator-activated receptor delta
LigandBDBM50126021
Substrate/Competitorn/a
Meas. Tech.ChEMBL_153861 (CHEMBL762590)
EC50 80±n/a nM
Citation Santini, CBerger, GDHan, WMosley, RMacNaul, KBerger, JDoebber, TWu, MMoller, DETolman, RLSahoo, SP Phenylacetic acid derivatives as hPPAR agonists. Bioorg Med Chem Lett13:1277-80 (2003) Peroxisome proliferator-activated receptor delta
Name:Peroxisome proliferator-activated receptor delta
Type:Enzyme
Mol. Mass.:49910.45
Organism:Homo sapiens (Human)
Description:Q03181
Residue:441
BDBM50126021
NameBDBM50126021
Synonyms:CHEMBL23881 | {4-[3-(4-Acetyl-3-hydroxy-2-propyl-phenoxy)-propylsulfanyl]-3-chloro-phenyl}-acetic acid
TypeSmall organic molecule
Emp. Form.C22H25ClO5S
Mol. Mass.436.949
SMILESCCCc1c(O)c(ccc1OCCCSc1ccc(CC(O)=O)cc1Cl)C(C)=O