Reaction Details
TargetPeroxisome proliferator-activated receptor delta
LigandBDBM50085040
Substrate/Competitorn/a
Meas. Tech.ChEMBL_153884 (CHEMBL759406)
IC50 6±n/a nM
Citation Santini, CBerger, GDHan, WMosley, RMacNaul, KBerger, JDoebber, TWu, MMoller, DETolman, RLSahoo, SP Phenylacetic acid derivatives as hPPAR agonists. Bioorg Med Chem Lett13:1277-80 (2003) Peroxisome proliferator-activated receptor delta
Name:Peroxisome proliferator-activated receptor delta
Type:Enzyme
Mol. Mass.:49910.45
Organism:Homo sapiens (Human)
Description:Q03181
Residue:441
BDBM50085040
NameBDBM50085040
Synonyms:CHEMBL278994 {3-Chloro-4-[3-(3-phenyl-7-propyl-benzofuran-6-yloxy)-propylsulfanyl]-phenyl}-acetic acid | {3-Chloro-4-[3-(3-phenyl-7-propyl-benzofuran-6-yloxy)-propylsulfanyl]-phenyl}-acetic acid(L-796449)
TypeSmall organic molecule
Emp. Form.C28H27ClO4S
Mol. Mass.495.03
SMILESCCCc1c(OCCCSc2ccc(CC(O)=O)cc2Cl)ccc2c(coc12)-c1ccccc1