Reaction Details
TargetPeroxisome proliferator-activated receptor gamma
LigandBDBM50126017
Substrate/Competitorn/a
Meas. Tech.ChEMBL_154209 (CHEMBL759454)
IC50 560±n/a nM
Citation Santini, CBerger, GDHan, WMosley, RMacNaul, KBerger, JDoebber, TWu, MMoller, DETolman, RLSahoo, SP Phenylacetic acid derivatives as hPPAR agonists. Bioorg Med Chem Lett13:1277-80 (2003) Peroxisome proliferator-activated receptor gamma
Name:Peroxisome proliferator-activated receptor gamma
Type:Nuclear Receptor
Mol. Mass.:57613.46
Organism:Homo sapiens (Human)
Description:P37231
Residue:505
BDBM50126017
NameBDBM50126017
Synonyms:CHEMBL23670 | {3-Chloro-4-[3-(3-ethyl-7-propyl-benzofuran-6-yloxy)-propylsulfanyl]-phenyl}-acetic acid
TypeSmall organic molecule
Emp. Form.C24H27ClO4S
Mol. Mass.446.987
SMILESCCCc1c(OCCCSc2ccc(CC(O)=O)cc2Cl)ccc2c(CC)coc12