Reaction Details
TargetPeroxisome proliferator-activated receptor alpha
LigandBDBM50085040
Substrate/Competitorn/a
Meas. Tech.ChEMBL_153386 (CHEMBL760606)
EC50 18±n/a nM
Citation Santini, CBerger, GDHan, WMosley, RMacNaul, KBerger, JDoebber, TWu, MMoller, DETolman, RLSahoo, SP Phenylacetic acid derivatives as hPPAR agonists. Bioorg Med Chem Lett13:1277-80 (2003) Peroxisome proliferator-activated receptor alpha
Name:Peroxisome proliferator-activated receptor alpha
Type:Enzyme
Mol. Mass.:52222.08
Organism:Homo sapiens (Human)
Description:Q07869
Residue:468
BDBM50085040
NameBDBM50085040
Synonyms:CHEMBL278994 {3-Chloro-4-[3-(3-phenyl-7-propyl-benzofuran-6-yloxy)-propylsulfanyl]-phenyl}-acetic acid | {3-Chloro-4-[3-(3-phenyl-7-propyl-benzofuran-6-yloxy)-propylsulfanyl]-phenyl}-acetic acid(L-796449)
TypeSmall organic molecule
Emp. Form.C28H27ClO4S
Mol. Mass.495.03
SMILESCCCc1c(OCCCSc2ccc(CC(O)=O)cc2Cl)ccc2c(coc12)-c1ccccc1