Reaction Details
TargetPeroxisome proliferator-activated receptor gamma
LigandBDBM50126019
Substrate/Competitorn/a
Meas. Tech.ChEMBL_154187 (CHEMBL762736)
EC50 15±n/a nM
Citation Santini, CBerger, GDHan, WMosley, RMacNaul, KBerger, JDoebber, TWu, MMoller, DETolman, RLSahoo, SP Phenylacetic acid derivatives as hPPAR agonists. Bioorg Med Chem Lett13:1277-80 (2003) Peroxisome proliferator-activated receptor gamma
Name:Peroxisome proliferator-activated receptor gamma
Type:Nuclear Receptor
Mol. Mass.:57613.46
Organism:Homo sapiens (Human)
Description:P37231
Residue:505
BDBM50126019
NameBDBM50126019
Synonyms:CHEMBL1783033 {3-Chloro-4-[3-(3-hydroxy-4-{1-[(E)-hydroxyimino]-propyl}-2-propyl-phenoxy)-propylsulfanyl]-phenyl}-acetic acid
TypeSmall organic molecule
Emp. Form.C23H28ClNO5S
Mol. Mass.465.99
SMILESCCCc1c(OCCCSc2ccc(CC(O)=O)cc2Cl)ccc(C(CC)N=O)c1O