Reaction Details
TargetPeroxisome proliferator-activated receptor alpha
LigandBDBM50126020
Substrate/Competitorn/a
Meas. Tech.ChEMBL_153535 (CHEMBL765404)
IC50 600±n/a nM
Citation Santini, CBerger, GDHan, WMosley, RMacNaul, KBerger, JDoebber, TWu, MMoller, DETolman, RLSahoo, SP Phenylacetic acid derivatives as hPPAR agonists. Bioorg Med Chem Lett13:1277-80 (2003) Peroxisome proliferator-activated receptor alpha
Name:Peroxisome proliferator-activated receptor alpha
Type:Enzyme
Mol. Mass.:52222.08
Organism:Homo sapiens (Human)
Description:Q07869
Residue:468
BDBM50126020
NameBDBM50126020
Synonyms:CHEMBL25710 | {3-Chloro-4-[3-(3-hydroxy-4-propionyl-2-propyl-phenoxy)-propylsulfanyl]-phenyl}-acetic acid
TypeSmall organic molecule
Emp. Form.C23H27ClO5S
Mol. Mass.450.975
SMILESCCCc1c(O)c(ccc1OCCCSc1ccc(CC(O)=O)cc1Cl)C(=O)CC