Reaction Details
TargetPeroxisome proliferator-activated receptor delta
LigandBDBM50126016
Substrate/Competitorn/a
Meas. Tech.ChEMBL_153884 (CHEMBL759406)
IC50 4±n/a nM
Citation Santini, CBerger, GDHan, WMosley, RMacNaul, KBerger, JDoebber, TWu, MMoller, DETolman, RLSahoo, SP Phenylacetic acid derivatives as hPPAR agonists. Bioorg Med Chem Lett13:1277-80 (2003) Peroxisome proliferator-activated receptor delta
Name:Peroxisome proliferator-activated receptor delta
Type:Enzyme
Mol. Mass.:49910.45
Organism:Homo sapiens (Human)
Description:Q03181
Residue:441
BDBM50126016
NameBDBM50126016
Synonyms:2-(3-chloro-4-(3-(3-ethyl-7-propylbenzo[d]isoxazol-6-yloxy)propylthio)phenyl)acetic acid {3-Chloro-4-[3-(3-ethyl-7-propyl-benzo[d]isoxazol-6-yloxy)-propylsulfanyl]-phenyl}-acetic acid
TypeSmall organic molecule
Emp. Form.C23H26ClNO4S
Mol. Mass.447.975
SMILESCCCc1c(OCCCSc2ccc(CC(O)=O)cc2Cl)ccc2c(CC)noc12