Reaction Details
TargetPeroxisome proliferator-activated receptor delta
LigandBDBM50126019
Substrate/Competitorn/a
Meas. Tech.ChEBML_153884
IC50 10±n/a nM
Citation Santini, CBerger, GDHan, WMosley, RMacNaul, KBerger, JDoebber, TWu, MMoller, DETolman, RLSahoo, SP Phenylacetic acid derivatives as hPPAR agonists. Bioorg Med Chem Lett13:1277-80 (2003) Peroxisome proliferator-activated receptor delta
Name:Peroxisome proliferator-activated receptor delta
Type:Enzyme
Mol. Mass.:49910.45
Organism:Homo sapiens (Human)
Description:Q03181
Residue:441
BDBM50126019
NameBDBM50126019
Synonyms:CHEMBL1783033 {3-Chloro-4-[3-(3-hydroxy-4-{1-[(E)-hydroxyimino]-propyl}-2-propyl-phenoxy)-propylsulfanyl]-phenyl}-acetic acid
TypeSmall organic molecule
Emp. Form.C23H28ClNO5S
Mol. Mass.465.99
SMILESCCCc1c(OCCCSc2ccc(CC(O)=O)cc2Cl)ccc(C(CC)N=O)c1O