Reaction Details
TargetPeroxisome proliferator-activated receptor alpha
LigandBDBM50126021
Substrate/Competitorn/a
Meas. Tech.ChEMBL_153535 (CHEMBL765404)
IC50 7400±n/a nM
Citation Santini, CBerger, GDHan, WMosley, RMacNaul, KBerger, JDoebber, TWu, MMoller, DETolman, RLSahoo, SP Phenylacetic acid derivatives as hPPAR agonists. Bioorg Med Chem Lett13:1277-80 (2003) Peroxisome proliferator-activated receptor alpha
Name:Peroxisome proliferator-activated receptor alpha
Type:Enzyme
Mol. Mass.:52222.08
Organism:Homo sapiens (Human)
Description:Q07869
Residue:468
BDBM50126021
NameBDBM50126021
Synonyms:CHEMBL23881 | {4-[3-(4-Acetyl-3-hydroxy-2-propyl-phenoxy)-propylsulfanyl]-3-chloro-phenyl}-acetic acid
TypeSmall organic molecule
Emp. Form.C22H25ClO5S
Mol. Mass.436.949
SMILESCCCc1c(O)c(ccc1OCCCSc1ccc(CC(O)=O)cc1Cl)C(C)=O