Reaction Details
TargetPeroxisome proliferator-activated receptor delta
LigandBDBM50126020
Substrate/Competitorn/a
Meas. Tech.ChEBML_153884
IC50 20±n/a nM
Citation Santini, CBerger, GDHan, WMosley, RMacNaul, KBerger, JDoebber, TWu, MMoller, DETolman, RLSahoo, SP Phenylacetic acid derivatives as hPPAR agonists. Bioorg Med Chem Lett13:1277-80 (2003) Peroxisome proliferator-activated receptor delta
Name:Peroxisome proliferator-activated receptor delta
Type:Enzyme
Mol. Mass.:49910.45
Organism:Homo sapiens (Human)
Description:Q03181
Residue:441
BDBM50126020
NameBDBM50126020
Synonyms:CHEMBL25710 | {3-Chloro-4-[3-(3-hydroxy-4-propionyl-2-propyl-phenoxy)-propylsulfanyl]-phenyl}-acetic acid
TypeSmall organic molecule
Emp. Form.C23H27ClO5S
Mol. Mass.450.975
SMILESCCCc1c(O)c(ccc1OCCCSc1ccc(CC(O)=O)cc1Cl)C(=O)CC