Reaction Details
TargetPeroxisome proliferator-activated receptor alpha
LigandBDBM50126019
Substrate/Competitorn/a
Meas. Tech.ChEBML_153535
EC50 74±n/a nM
Citation Santini, CBerger, GDHan, WMosley, RMacNaul, KBerger, JDoebber, TWu, MMoller, DETolman, RLSahoo, SP Phenylacetic acid derivatives as hPPAR agonists. Bioorg Med Chem Lett13:1277-80 (2003) Peroxisome proliferator-activated receptor alpha
Name:Peroxisome proliferator-activated receptor alpha
Type:Enzyme
Mol. Mass.:52222.08
Organism:Homo sapiens (Human)
Description:Q07869
Residue:468
BDBM50126019
NameBDBM50126019
Synonyms:CHEMBL1783033 {3-Chloro-4-[3-(3-hydroxy-4-{1-[(E)-hydroxyimino]-propyl}-2-propyl-phenoxy)-propylsulfanyl]-phenyl}-acetic acid
TypeSmall organic molecule
Emp. Form.C23H28ClNO5S
Mol. Mass.465.99
SMILESCCCc1c(OCCCSc2ccc(CC(O)=O)cc2Cl)ccc(C(CC)N=O)c1O