Reaction Details
TargetBeta-1 adrenergic receptor
LigandBDBM50126067
Substrate/Competitorn/a
Meas. Tech.ChEBML_37242
EC50 1.9±n/a nM
Citation Harada, HHirokawa, YSuzuki, KHiyama, YOue, MKawashima, HYoshida, NFurutani, YKato, S Novel and potent human and rat beta3-adrenergic receptor agonists containing substituted 3-indolylalkylamines. Bioorg Med Chem Lett13:1301-5 (2003) Beta-1 adrenergic receptor
Name:Beta-1 adrenergic receptor
Type:G Protein-Coupled Receptor (GPCR)
Mol. Mass.:51338.40
Organism:Homo sapiens (Human)
Description:P08588
Residue:477
BDBM50126067
NameBDBM50126067
Synonyms:(R)-1-((R)-3-Chloro-phenyl)-2-[2-(1H-indol-3-yl)-1-methyl-ethylamino]-ethanol | CHEMBL26393
TypeSmall organic molecule
Emp. Form.C19H21ClN2O
Mol. Mass.328.836
SMILESC[C@H](Cc1c[nH]c2ccccc12)NC[C@H](O)c1cccc(Cl)c1