Reaction Details
TargetProgesterone receptor
LigandBDBM50067678
Substrate/Competitorn/a
Meas. Tech.ChEMBL_177403 (CHEMBL782725)
IC50 67.3±n/a nM
Citation Fensome, AKoko, MWrobel, JZhang, PZhang, ZCohen, JLundeen, SRudnick, KZhu, YWinneker, R Novel 5-aryl-1,3-dihydro-indole-2-thiones. potent, orally active progesterone receptor agonists. Bioorg Med Chem Lett13:1317-20 (2003) Progesterone receptor
Name:Progesterone receptor
Type:PROTEIN
Mol. Mass.:99414.34
Organism:Rattus norvegicus
Description:ChEMBL_159714
Residue:923
BDBM50067678
NameBDBM50067678
Synonyms:(6alpha)-17-(Acetyloxy)-6-methylpreg-4-ene-3,20-dione 17-Acetoxy-6alpha-methylprogesterone 6-alpha-Methyl-17-alpha-acetoxyprogesterone 6alpha-Methyl-17-acetoxy progesterone 6alpha-Methyl-4-pregnene-3,20-dion-17alpha-ol acetate Medroxyacetate progesterone Methylacetoxyprogesterone US9271961, MPA | medroxyprogesterone acetate
TypeSmall organic molecule
Emp. Form.C24H34O4
Mol. Mass.386.5244
SMILESC[C@H]1C[C@H]2[C@@H]3CC[C@](OC(C)=O)(C(C)=O)[C@@]3(C)CC[C@@H]2[C@@]2(C)CCC(=O)C=C12