Reaction Details
TargetInosine-5'-monophosphate dehydrogenase 2
LigandBDBM50126275
Substrate/Competitorn/a
Meas. Tech.ChEBML_235
IC50 5±n/a nM
Citation Chen, PNorris, DHaslow, KDMurali Dhar, TGPitts, WJWatterson, SHCheney, DLBassolino, DAFleener, CARouleau, KAHollenbaugh, DLTownsend, RMBarrish, JCIwanowicz, EJ Identification of novel and potent isoquinoline aminooxazole-based IMPDH inhibitors. Bioorg Med Chem Lett13:1345-8 (2003) Inosine-5'-monophosphate dehydrogenase 2
Name:Inosine-5'-monophosphate dehydrogenase 2
Type:Enzyme
Mol. Mass.:55806.87
Organism:Homo sapiens (Human)
Description:Recombinant IMPDH2 expressed in E. coli.
Residue:514
BDBM50126275
NameBDBM50126275
Synonyms:CHEMBL280793 | Isoquinolin-6-yl-(5-phenyl-oxazol-2-yl)-amine
TypeSmall organic molecule
Emp. Form.C18H13N3O
Mol. Mass.287.3153
SMILESN(c1ncc(o1)-c1ccccc1)c1ccc2cnccc2c1