Reaction Details
TargetProthrombin
LigandBDBM50126303
Substrate/Competitorn/a
Meas. Tech.ChEBML_208518
Ki 0.160000±n/a nM
Citation Burgey, CSRobinson, KALyle, TANantermet, PGSelnick, HGIsaacs, RCLewis, SDLucas, BJKrueger, JASingh, RMiller-Stein, CWhite, RBWong, BLyle, EAStranieri, MTCook, JJMcMasters, DRPellicore, JMPal, SWallace, AAClayton, FCBohn, DWelsh, DCLynch, JJYan, YChen, ZKuo, LGardell, SJShafer, JAVacca, JP Pharmacokinetic optimization of 3-amino-6-chloropyrazinone acetamide thrombin inhibitors. Implementation of P3 pyridine N-oxides to deliver an orally bioavailable series containing P1 N-benzylamides. Bioorg Med Chem Lett13:1353-7 (2003) Prothrombin
Name:Prothrombin
Type:Protein
Mol. Mass.:70029.57
Organism:Homo sapiens (Human)
Description:P00734
Residue:622
BDBM50126303
NameBDBM50126303
Synonyms:2-{6-Chloro-3-[2,2-difluoro-2-(1-oxy-pyridin-2-yl)-ethylamino]-2-oxo-2H-pyrazin-1-yl}-N-(5-chloro-2-fluoro-benzyl)-acetamide | CHEMBL26679
TypeSmall organic molecule
Emp. Form.C20H16Cl2F3N5O3
Mol. Mass.502.274
SMILES[O-][n+]1ccccc1C(F)(F)CNc1ncc(Cl)n(CC(=O)NCc2cc(Cl)ccc2F)c1=O