Reaction Details
TargetProthrombin
LigandBDBM50126309
Substrate/Competitorn/a
Meas. Tech.ChEBML_208518
Ki 0.190000±n/a nM
Citation Burgey, CSRobinson, KALyle, TANantermet, PGSelnick, HGIsaacs, RCLewis, SDLucas, BJKrueger, JASingh, RMiller-Stein, CWhite, RBWong, BLyle, EAStranieri, MTCook, JJMcMasters, DRPellicore, JMPal, SWallace, AAClayton, FCBohn, DWelsh, DCLynch, JJYan, YChen, ZKuo, LGardell, SJShafer, JAVacca, JP Pharmacokinetic optimization of 3-amino-6-chloropyrazinone acetamide thrombin inhibitors. Implementation of P3 pyridine N-oxides to deliver an orally bioavailable series containing P1 N-benzylamides. Bioorg Med Chem Lett13:1353-7 (2003) Prothrombin
Name:Prothrombin
Type:Protein
Mol. Mass.:70029.57
Organism:Homo sapiens (Human)
Description:P00734
Residue:622
BDBM50126309
NameBDBM50126309
Synonyms:CHEMBL29744 | N-(3-Bromo-benzyl)-2-{6-chloro-3-[2,2-difluoro-2-(1-oxy-pyridin-2-yl)-ethylamino]-2-oxo-2H-pyrazin-1-yl}-acetamide
TypeSmall organic molecule
Emp. Form.C20H17BrClF2N5O3
Mol. Mass.528.734
SMILES[O-][n+]1ccccc1C(F)(F)CNc1ncc(Cl)n(CC(=O)NCc2cccc(Br)c2)c1=O