Reaction Details
TargetDual 3',5'-cyclic-AMP and -GMP phosphodiesterase 11A
LigandBDBM50126472
Substrate/Competitorn/a
Meas. Tech.ChEBML_156293
IC50 71±n/a nM
Citation Maw, GNAllerton, CMGbekor, EMillion, WA Design, synthesis and biological activity of beta-carboline-based type-5 phosphodiesterase inhibitors. Bioorg Med Chem Lett13:1425-8 (2003) Dual 3',5'-cyclic-AMP and -GMP phosphodiesterase 11A
Name:Dual 3',5'-cyclic-AMP and -GMP phosphodiesterase 11A
Type:Enzyme
Mol. Mass.:104751.53
Organism:Homo sapiens (Human)
Description:Q9HCR9
Residue:933
BDBM50126472
NameBDBM50126472
Synonyms:(6R,12aR)-2-((R)-1-Benzyl-pyrrolidin-3-yl)-6-(4-methoxy-3-methyl-phenyl)-2,3,6,7,12,12a-hexahydro-pyrazino[1',2':1,6]pyrido[3,4-b]indole-1,4-dione | CHEMBL284535
TypeSmall organic molecule
Emp. Form.C33H34N4O3
Mol. Mass.534.6481
SMILESCOc1ccc(cc1C)[C@H]1N2[C@H](Cc3c1[nH]c1ccccc31)C(=O)N(CC2=O)[C@@H]1CCN(Cc2ccccc2)C1