Reaction Details
Target5-hydroxytryptamine receptor 1A
LigandBDBM50126474
Substrate/Competitorn/a
Meas. Tech.ChEBML_1109
Ki 2.4±n/a nM
Citation López-Rodríguez, MLMorcillo, MJFernández, EBenhamú, BTejada, IAyala, DViso, AOlivella, MPardo, LDelgado, MManzanares, JFuentes, JA Design and synthesis of S-(-)-2-[[4-(napht-1-yl)piperazin-1-yl]methyl]-1,4-dioxoperhydropyrrolo[1,2-a]pyrazine (CSP-2503) using computational simulation. A 5-HT1A receptor agonist. Bioorg Med Chem Lett13:1429-32 (2003) 5-hydroxytryptamine receptor 1A
Name:5-hydroxytryptamine receptor 1A
Type:G Protein-Coupled Receptor (GPCR)
Mol. Mass.:46445.29
Organism:Rattus norvegicus (rat)
Description:Binding assays were performed using rat hippocampal membranes.
Residue:422
BDBM50126474
NameBDBM50126474
Synonyms:2-[4-(4-Naphthalen-1-yl-piperazin-1-yl)-butyl]-tetrahydro-pyrrolo[1,2-c]imidazole-1,3-dione | CHEMBL33150
TypeSmall organic molecule
Emp. Form.C24H30N4O2
Mol. Mass.406.5206
SMILESOc1c2CCCn2c(=O)n1CCCCN1CCN(CC1)c1cccc2ccccc12