Reaction Details
Target5-hydroxytryptamine receptor 1A
LigandBDBM50126477
Substrate/Competitorn/a
Meas. Tech.ChEBML_1109
Ki 5.6±n/a nM
Citation López-Rodríguez, MLMorcillo, MJFernández, EBenhamú, BTejada, IAyala, DViso, AOlivella, MPardo, LDelgado, MManzanares, JFuentes, JA Design and synthesis of S-(-)-2-[[4-(napht-1-yl)piperazin-1-yl]methyl]-1,4-dioxoperhydropyrrolo[1,2-a]pyrazine (CSP-2503) using computational simulation. A 5-HT1A receptor agonist. Bioorg Med Chem Lett13:1429-32 (2003) 5-hydroxytryptamine receptor 1A
Name:5-hydroxytryptamine receptor 1A
Type:G Protein-Coupled Receptor (GPCR)
Mol. Mass.:46445.29
Organism:Rattus norvegicus (rat)
Description:Binding assays were performed using rat hippocampal membranes.
Residue:422
BDBM50126477
NameBDBM50126477
Synonyms:2-(4-Naphthalen-1-yl-piperazin-1-ylmethyl)-tetrahydro-imidazo[1,5-a]pyridine-1,3-dione | CHEMBL445055
TypeSmall organic molecule
Emp. Form.C22H26N4O2
Mol. Mass.378.4674
SMILESOc1c2CCCCn2c(=O)n1CN1CCN(CC1)c1cccc2ccccc12