Reaction Details
TargetProthrombin
LigandBDBM50126525
Substrate/Competitorn/a
Meas. Tech.ChEBML_208514
Ki 0.057000±n/a nM
Citation Boatman, PDUrban, JNguyen, MQabar, MKahn, M High-throughput synthesis and optimization of thrombin inhibitors via urazole alpha-addition and Michael addition. Bioorg Med Chem Lett13:1445-9 (2003) Prothrombin
Name:Prothrombin
Type:Protein
Mol. Mass.:70029.57
Organism:Homo sapiens (Human)
Description:P00734
Residue:622
BDBM50126525
NameBDBM50126525
Synonyms:2-{5-[(6-Amino-2-methyl-pyridin-3-ylmethyl)-carbamoyl]-1,3-dioxo-5,8-dihydro-[1,2,4]triazolo[1,2-a]pyridazin-2-yl}-3-(4-chloro-phenylsulfanyl)-propionic acid cyclohexyl ester | CHEMBL32887
TypeSmall organic molecule
Emp. Form.C29H33ClN6O5S
Mol. Mass.613.128
SMILESCc1nc(N)ccc1CNC(=O)C1C=CCn2n1c(=O)n(C(CSc1ccc(Cl)cc1)C(=O)OC1CCCCC1)c2=O