Reaction Details
TargetIntegrin alpha-V/beta-3
LigandBDBM50078714
Substrate/Competitorn/a
Meas. Tech.ChEMBL_217802 (CHEMBL823258)
IC50 60±n/a nM
Citation Miller, WHManley, PJCousins, RDErhard, KFHeerding, DAKwon, CRoss, STSamanen, JMTakata, DTUzinskas, INYuan, CCHaltiwanger, RCGress, CJLark, MWHwang, SMJames, IERieman, DJWillette, RNYue, TLAzzarano, LMSalyers, KLSmith, BRWard, KWJohanson, KOHuffman, WF Phenylbutyrates as potent, orally bioavailable vitronectin receptor (integrin alphavbeta3) antagonists. Bioorg Med Chem Lett13:1483-6 (2003) Integrin alpha-V/beta-3
Name:Integrin alpha-V/beta-3
Type:Enzyme
Mol. Mass.:n/a
Description:n/a
Components:This complex has 2 components.
Component 1
Name:Integrin alpha-V
Synonyms:ITAV_HUMAN Integrin alpha-V/alpha-5 VNRA Vitronectin receptor | Vitronectin receptor subunit alpha
Type:PROTEIN
Mol. Mass.:116024.92
Organism:Homo sapiens (Human)
Description:ChEMBL_582336
Residue:1048
Component 2
Name:Integrin beta-3
Synonyms:CD_antigen=CD61 GPIIIa ITGB3 Platelet membrane glycoprotein IIIa
Type:Protein
Mol. Mass.:87038.91
Organism:Homo sapiens (Human)
Description:P05106
Residue:788
BDBM50078714
NameBDBM50078714
Synonyms:CHEMBL288493 {(S)-3-[3-(Pyridin-2-ylamino)-propoxy]-10,11-dihydro-5H-dibenzo[a,d]cyclohepten-10-yl}-acetic acid | {3-[3-(Pyridin-2-ylamino)-propoxy]-10,11-dihydro-5H-dibenzo[a,d]cyclohepten-10-yl}-acetic acid
TypeSmall organic molecule
Emp. Form.C25H26N2O3
Mol. Mass.402.4855
SMILESOC(=O)C[C@@H]1Cc2ccc(OCCCNc3ccccn3)cc2Cc2ccccc12