Reaction Details
TargetPeroxisome proliferator-activated receptor gamma
LigandBDBM28798
Substrate/Competitorn/a
Meas. Tech.ChEMBL_154213 (CHEMBL759458)
IC50 350±n/a nM
Citation Ebdrup, SPettersson, IRasmussen, HBDeussen, HJFrost Jensen, AMortensen, SBFleckner, JPridal, LNygaard, LSauerberg, P Synthesis and biological and structural characterization of the dual-acting peroxisome proliferator-activated receptor alpha/gamma agonist ragaglitazar. J Med Chem46:1306-17 (2003) 
 
Peroxisome proliferator-activated receptor gamma
Name:Peroxisome proliferator-activated receptor gamma
Type:Nuclear Receptor
Mol. Mass.:57613.46
Organism:Homo sapiens (Human)
Description:P37231
Residue:505
BDBM28798
NameBDBM28798
Synonyms:(2S)-2-ethoxy-3-(4-{2-[4-(methanesulfonyloxy)phenyl]ethoxy}phenyl)propanoic acid Galida | tesaglitazar
TypeSmall organic molecule
Emp. Form.C20H24O7S
Mol. Mass.408.465
SMILESCCO[C@@H](Cc1ccc(OCCc2ccc(OS(C)(=O)=O)cc2)cc1)C(O)=O