Reaction Details
TargetTyrosine-protein kinase Lck
LigandBDBM50126760
Substrate/Competitorn/a
Meas. Tech.ChEMBL_221314 (CHEMBL841204)
IC50 120±n/a nM
Citation Goldberg, DRButz, TCardozo, MGEckner, RJHammach, AHuang, JJakes, SKapadia, SKashem, MLukas, SMorwick, TMPanzenbeck, MPatel, UPav, SPeet, GWPeterson, JDProkopowicz, ASSnow, RJSellati, RTakahashi, HTan, JTschantz, MAWang, XJWang, YWolak, JXiong, PMoss, N Optimization of 2-phenylaminoimidazo[4,5-h]isoquinolin-9-ones: orally active inhibitors of lck kinase. J Med Chem46:1337-49 (2003) 
 
Tyrosine-protein kinase Lck
Name:Tyrosine-protein kinase Lck
Type:n/a
Mol. Mass.:57987.83
Organism:Homo sapiens (Human)
Description:P06239
Residue:509
BDBM50126760
NameBDBM50126760
Synonyms:2-(2,6-Dichloro-phenylamino)-1,7-dimethyl-6-(3-morpholin-4-yl-3-oxo-propyl)-1,8-dihydro-imidazo[4,5-h]isoquinolin-9-one | CHEMBL26147
TypeSmall organic molecule
Emp. Form.C25H25Cl2N5O3
Mol. Mass.514.404
SMILESCc1[nH]c(=O)c2c3n(C)c(Nc4c(Cl)cccc4Cl)nc3ccc2c1CCC(=O)N1CCOCC1