Reaction Details
TargetSodium-dependent dopamine transporter
LigandBDBM50118599
Substrate/Competitorn/a
Meas. Tech.ChEMBL_62334 (CHEMBL674427)
Ki 0.7±n/a nM
Citation Greiner, EPrisinzano, TJohnson II, EMDersch, CMMarcus, JPartilla, JSRothman, RBJacobson, AERice, KC Structure-activity relationship studies of highly selective inhibitors of the dopamine transporter: N-benzylpiperidine analogues of 1-[2-[bis(4-fluorophenyl)methoxy]ethyl]-4-(3-phenylpropyl)piperazine. J Med Chem46:1465-9 (2003) 
 
Sodium-dependent dopamine transporter
Name:Sodium-dependent dopamine transporter
Type:Multi-pass membrane protein
Mol. Mass.:68749.45
Organism:Rattus norvegicus (rat)
Description:P23977
Residue:619
BDBM50118599
NameBDBM50118599
Synonyms:4-(2-(bis(4-fluorophenyl)methoxy)ethyl)-1-(naphthalen-2-ylmethyl)piperidine CHEMBL416409
TypeSmall organic molecule
Emp. Form.C31H31F2NO
Mol. Mass.471.5807
SMILESFc1ccc(cc1)C(OCCC1CCN(Cc2ccc3ccccc3c2)CC1)c1ccc(F)cc1