Reaction Details
TargetSodium-dependent dopamine transporter
LigandBDBM50126815
Substrate/Competitorn/a
Meas. Tech.ChEMBL_62636 (CHEMBL676682)
Ki 13.6±n/a nM
Citation Greiner, EPrisinzano, TJohnson II, EMDersch, CMMarcus, JPartilla, JSRothman, RBJacobson, AERice, KC Structure-activity relationship studies of highly selective inhibitors of the dopamine transporter: N-benzylpiperidine analogues of 1-[2-[bis(4-fluorophenyl)methoxy]ethyl]-4-(3-phenylpropyl)piperazine. J Med Chem46:1465-9 (2003) 
 
Sodium-dependent dopamine transporter
Name:Sodium-dependent dopamine transporter
Type:Multi-pass membrane protein
Mol. Mass.:68749.45
Organism:Rattus norvegicus (rat)
Description:P23977
Residue:619
BDBM50126815
NameBDBM50126815
Synonyms:1-(4-iodobenzyl)-4-(2-(bis(4-fluorophenyl)methoxy)ethyl)piperidine CHEMBL284096
TypeSmall organic molecule
Emp. Form.C27H28F2INO
Mol. Mass.547.4186
SMILESFc1ccc(cc1)C(OCCC1CCN(Cc2ccc(I)cc2)CC1)c1ccc(F)cc1