Reaction Details
TargetProtein kinase C alpha type
LigandBDBM50127015
Substrate/Competitorn/a
Meas. Tech.ChEMBL_160296 (CHEMBL769624)
Ki 15±n/a nM
Citation Sigano, DMPeach, MLNacro, KChoi, YLewin, NENicklaus, MCBlumberg, PMMarquez, VE Differential binding modes of diacylglycerol (DAG) and DAG lactones to protein kinase C (PK-C). J Med Chem46:1571-9 (2003) 
 
Protein kinase C alpha type
Name:Protein kinase C alpha type
Type:Enzyme
Mol. Mass.:76755.65
Organism:Homo sapiens (Human)
Description:The recombinant human PKC enzymes were produced using a baculovirus expression system in SF9 cells
Residue:672
BDBM50127015
NameBDBM50127015
Synonyms:3-Isopropyl-4-methyl-pentanoic acid 3-hydroxymethyl-4-(3-methyl-butylidene)-5-oxo-tetrahydro-furan-2-ylmethyl ester | CHEMBL39488
TypeSmall organic molecule
Emp. Form.C20H34O5
Mol. Mass.354.481
SMILESCC(C)C\C=C1/CC(CO)(COC(=O)CC(C(C)C)C(C)C)OC1=O