Reaction Details
TargetHistone deacetylase 6
LigandBDBM22449
Substrate/Competitorn/a
Meas. Tech.ChEMBL_2081901 (CHEMBL4737692)
IC50 8.5±n/a nM
Citation Mak, JYWWu, KCGupta, PKBarbero, SMcLaughlin, MGLucke, AJTng, JLim, JLoh, ZSweet, MJReid, RCLiu, LFairlie, DP HDAC7 Inhibition by Phenacetyl and Phenylbenzoyl Hydroxamates. J Med Chem64:2186-2204 (2021) 
 
Histone deacetylase 6
Name:Histone deacetylase 6
Type:Chromatin regulator; hydrolase; repressor
Mol. Mass.:131381.51
Organism:Homo sapiens (Human)
Description:Q9UBN7
Residue:1215
BDBM22449
NameBDBM22449
Synonyms:CHEMBL356769 Tubacin | US9249087, Tubastatin A
TypeSmall organic molecule
Emp. Form.C41H43N3O7S
Mol. Mass.721.861
SMILESOCc1ccc(cc1)[C@@H]1C[C@H](CSc2nc(c(o2)-c2ccccc2)-c2ccccc2)O[C@@H](O1)c1ccc(NC(=O)CCCCCCC(=O)NO)cc1