Reaction Details
TargetIntegrin alpha-5/beta-1
LigandBDBM50241180
Substrate/Competitorn/a
Meas. Tech.ChEMBL_217628 (CHEMBL820371)
IC50 2200±n/a nM
Citation Bourguet, EBanères, JLParello, JLusinchi, XGirard, JPVidal, JP Nonpeptide RGD antagonists: a novel class of mimetics, the 5,8-disubstituted 1-azabicyclo[5.2.0]nonan-2-one lactam. Bioorg Med Chem Lett13:1561-4 (2003) Integrin alpha-5/beta-1
Name:Integrin alpha-5/beta-1
Type:Enzyme
Mol. Mass.:n/a
Description:n/a
Components:This complex has 2 components.
Component 1
Name:Integrin alpha-5
Synonyms:CD49 antigen-like family member E FNRA Fibronectin receptor subunit alpha ITGA5 Integrin alpha-F | VLA-5
Type:Single-pass type I membrane protein
Mol. Mass.:114523.00
Organism:Homo sapiens (Human)
Description:n/a
Residue:1049
Component 2
Name:Integrin beta-1
Synonyms:CD_antigen=CD29 Fibronectin receptor beta GPIIA ITGB1 MDF2 | MSK12
Type:Enzyme
Mol. Mass.:88400.38
Organism:Homo sapiens (Human)
Description:P05556
Residue:798
BDBM50241180
NameBDBM50241180
Synonyms:(6S,12S,15S)-1,6-diamino-12-(carboxymethyl)-16-hydroxy-1-imino-7,10,13-trioxo-2,8,11,14-tetraazahexadecane-15-carboxylic acid (S)-3-[2-((S)-2-Amino-5-guanidino-pentanoylamino)-acetylamino]-N-((S)-1-carboxy-2-hydroxy-ethyl)-succinamic acid 2-{1-[1-amino-4-amino(imino)methylaminobutylcarboxamidomethylcarboxamido]-2-carboxyethylcarboxamido}-3-hydroxypropanoic acid 3-[2-((S)-2-Amino-5-guanidino-pentanoylamino)-acetylamino]-N-((S)-1-carboxy-2-hydroxy-ethyl)-succinamic acid 3-[2-(2-Amino-5-guanidino-pentanoylamino)-acetylamino]-N-(1-carboxy-2-hydroxy-ethyl)-succinamic acid (RGDS) RGDS
TypeSmall organic molecule
Emp. Form.C15H27N7O8
Mol. Mass.433.417
SMILES[#7]-[#6@@H](-[#6]-[#6]-[#6]\[#7]=[#6](/[#7])-[#7])-[#6](=O)-[#7]-[#6]-[#6](=O)-[#7]-[#6@@H](-[#6]-[#6](-[#8])=O)-[#6](=O)-[#7]-[#6@@H](-[#6]-[#8])-[#6](-[#8])=O