Reaction Details
TargetAryl hydrocarbon receptor
LigandBDBM50563365
Substrate/Competitorn/a
Meas. Tech.ChEMBL_2082218 (CHEMBL4738009)
EC50 2.0±n/a nM
Citation Dvo?ák, ZPoulíková, KMani, S Indole scaffolds as a promising class of the aryl hydrocarbon receptor ligands. Eur J Med Chem215:0 (2021) 
 
Aryl hydrocarbon receptor
Name:Aryl hydrocarbon receptor
Type:PROTEIN
Mol. Mass.:96143.77
Organism:Homo sapiens (Human)
Description:ChEMBL_1503828
Residue:848
BDBM50563365
NameBDBM50563365
Synonyms:CHEMBL4750416
TypeSmall organic molecule
Emp. Form.C15H9F3N2O
Mol. Mass.290.24
SMILESFC(F)(F)c1cccc(n1)C(=O)c1c[nH]c2ccccc12