Reaction Details
TargetReverse transcriptase/RNaseH
LigandBDBM50127554
Substrate/Competitorn/a
Meas. Tech.ChEMBL_197282 (CHEMBL804269)
EC50 50±n/a nM
Citation Kroeger Smith, MBHose, BMHawkins, ALipchock, JFarnsworth, DWRizzo, RCTirado-Rives, JArnold, EZhang, WHughes, SHJorgensen, WLMichejda, CJSmith, RH Molecular modeling calculations of HIV-1 reverse transcriptase nonnucleoside inhibitors: correlation of binding energy with biological activity for novel 2-aryl-substituted benzimidazole analogues. J Med Chem46:1940-7 (2003) 
 
Reverse transcriptase/RNaseH
Name:Reverse transcriptase/RNaseH
Type:PROTEIN
Mol. Mass.:65229.15
Organism:Human immunodeficiency virus 1
Description:ChEMBL_1473730
Residue:566
BDBM50127554
NameBDBM50127554
Synonyms:1-(2,6-difluorobenzyl)-2-(2,6-difluorophenyl)-4-hydroxymethylbenzimidazole [1-(2,6-Difluoro-benzyl)-2-(2,6-difluoro-phenyl)-1H-benzoimidazol-4-yl]-methanol
TypeSmall organic molecule
Emp. Form.C21H14F4N2O
Mol. Mass.386.3423
SMILESOCc1cccc2n(Cc3c(F)cccc3F)c(nc12)-c1c(F)cccc1F