Reaction Details
TargetCholesteryl ester transfer protein
LigandBDBM50128150
Substrate/Competitorn/a
Meas. Tech.ChEMBL_216899 (CHEMBL815632)
IC50 400±n/a nM
Citation Reinhard, EJWang, JLDurley, RCFobian, YMGrapperhaus, MLHickory, BSMassa, MANorton, MBPromo, MATollefson, MBVernier, WFConnolly, DTWitherbee, BJMelton, MARegina, KJSmith, MESikorski, JA Discovery of a simple picomolar inhibitor of cholesteryl ester transfer protein. J Med Chem46:2152-68 (2003) 
 
Cholesteryl ester transfer protein
Name:Cholesteryl ester transfer protein
Type:Enzyme
Mol. Mass.:54751.53
Organism:Homo sapiens (Human)
Description:P11597
Residue:493
BDBM50128150
NameBDBM50128150
Synonyms:3-((3-(1,1,2,2-tetrafluoroethoxy)benzyl)(3-(cyclopentyloxy)phenyl)amino)-1,1,1-trifluoropropan-2-ol 3-{(3-Cyclopentyloxy-phenyl)-[3-(1,1,2,2-tetrafluoro-ethoxy)-benzyl]-amino}-1,1,1-trifluoro-propan-2-ol | CHEMBL303833
TypeSmall organic molecule
Emp. Form.C23H24F7NO3
Mol. Mass.495.4304
SMILESOC(CN(Cc1cccc(OC(F)(F)C(F)F)c1)c1cccc(OC2CCCC2)c1)C(F)(F)F