Reaction Details
TargetCholesteryl ester transfer protein
LigandBDBM50128131
Substrate/Competitorn/a
Meas. Tech.ChEMBL_216903 (CHEMBL816918)
IC50 80±n/a nM
Citation Reinhard, EJWang, JLDurley, RCFobian, YMGrapperhaus, MLHickory, BSMassa, MANorton, MBPromo, MATollefson, MBVernier, WFConnolly, DTWitherbee, BJMelton, MARegina, KJSmith, MESikorski, JA Discovery of a simple picomolar inhibitor of cholesteryl ester transfer protein. J Med Chem46:2152-68 (2003) 
 
Cholesteryl ester transfer protein
Name:Cholesteryl ester transfer protein
Type:Enzyme
Mol. Mass.:54751.53
Organism:Homo sapiens (Human)
Description:P11597
Residue:493
BDBM50128131
NameBDBM50128131
Synonyms:(R)-3-((3-(1,1,2,2-tetrafluoroethoxy)benzyl)(3-(4-chloro-3-ethylphenoxy)phenyl)amino)-1,1,1-trifluoropropan-2-ol 3-{[3-(4-Chloro-3-ethyl-phenoxy)-phenyl]-[3-(1,1,2,2-tetrafluoro-ethoxy)-benzyl]-amino}-1,1,1-trifluoro-propan-2-ol SC-795
TypeSmall organic molecule
Emp. Form.C26H23ClF7NO3
Mol. Mass.565.908
SMILESCCc1cc(Oc2cccc(c2)N(C[C@@H](O)C(F)(F)F)Cc2cccc(OC(F)(F)C(F)F)c2)ccc1Cl