Reaction Details
TargetCholesteryl ester transfer protein
LigandBDBM50128183
Substrate/Competitorn/a
Meas. Tech.ChEMBL_216899 (CHEMBL815632)
IC50 300±n/a nM
Citation Reinhard, EJWang, JLDurley, RCFobian, YMGrapperhaus, MLHickory, BSMassa, MANorton, MBPromo, MATollefson, MBVernier, WFConnolly, DTWitherbee, BJMelton, MARegina, KJSmith, MESikorski, JA Discovery of a simple picomolar inhibitor of cholesteryl ester transfer protein. J Med Chem46:2152-68 (2003) 
 
Cholesteryl ester transfer protein
Name:Cholesteryl ester transfer protein
Type:Enzyme
Mol. Mass.:54751.53
Organism:Homo sapiens (Human)
Description:P11597
Residue:493
BDBM50128183
NameBDBM50128183
Synonyms:1,1,1-Trifluoro-3-{(3-isopropoxy-phenyl)-[3-(1,1,2,2-tetrafluoro-ethoxy)-benzyl]-amino}-propan-2-ol 3-((3-(1,1,2,2-tetrafluoroethoxy)benzyl)(3-isopropoxyphenyl)amino)-1,1,1-trifluoropropan-2-ol | CHEMBL68726
TypeSmall organic molecule
Emp. Form.C21H22F7NO3
Mol. Mass.469.3931
SMILESCC(C)Oc1cccc(c1)N(CC(O)C(F)(F)F)Cc1cccc(OC(F)(F)C(F)F)c1