Reaction Details
TargetHistamine H2 receptor
LigandBDBM50129254
Substrate/Competitorn/a
Meas. Tech.ChEBML_85654
Ki 1729±n/a nM
Citation Turner, SCEsbenshade, TABennani, YLHancock, AA A new class of histamine H(3)-receptor antagonists: synthesis and structure-activity relationships of 7,8,9,10-tetrahydro-6H-cyclohepta[b]quinolines. Bioorg Med Chem Lett13:2131-5 (2003) Histamine H2 receptor
Name:Histamine H2 receptor
Type:G Protein-Coupled Receptor (GPCR)
Mol. Mass.:40115.31
Organism:Homo sapiens (Human)
Description:n/a
Residue:359
BDBM50129254
NameBDBM50129254
Synonyms:CHEMBL303824 | [2-(1-Methyl-pyrrolidin-2-yl)-ethyl]-(7,8,9,10-tetrahydro-6H-cyclohepta[b]quinolin-11-yl)-amine
TypeSmall organic molecule
Emp. Form.C21H29N3
Mol. Mass.323.4751
SMILESCN1CCCC1CCNc1c2CCCCCc2nc2ccccc12