Reaction Details
TargetMuscarinic acetylcholine receptor M2
LigandBDBM50129387
Substrate/Competitorn/a
Meas. Tech.ChEBML_139760
Ki 11±n/a nM
Citation Ogino, YOhtake, NKobayashi, KKimura, TFujikawa, THasegawa, TNoguchi, KMase, T Muscarinic M(3) receptor antagonists with (2R)-2-[(1R)-3,3-difluorocyclopentyl]-2-hydroxyphenylacetamide Structures. Part 2. Bioorg Med Chem Lett13:2167-72 (2003) Muscarinic acetylcholine receptor M2
Name:Muscarinic acetylcholine receptor M2
Type:GPCR
Mol. Mass.:51730.61
Organism:Homo sapiens (Human)
Description:P08172
Residue:466
BDBM50129387
NameBDBM50129387
Synonyms:(R)-1-(4-Amino-piperidin-1-yl)-2-cyclopentyl-2-hydroxy-2-phenyl-ethanone | CHEMBL71431
TypeSmall organic molecule
Emp. Form.C18H26N2O2
Mol. Mass.302.4112
SMILESNC1CCN(CC1)C(=O)[C@@](O)(C1CCCC1)c1ccccc1