Reaction Details
TargetMuscarinic acetylcholine receptor M3
LigandBDBM50129400
Substrate/Competitorn/a
Meas. Tech.ChEBML_138705
Ki 11±n/a nM
Citation Ogino, YOhtake, NKobayashi, KKimura, TFujikawa, THasegawa, TNoguchi, KMase, T Muscarinic M(3) receptor antagonists with (2R)-2-[(1R)-3,3-difluorocyclopentyl]-2-hydroxyphenylacetamide Structures. Part 2. Bioorg Med Chem Lett13:2167-72 (2003) Muscarinic acetylcholine receptor M3
Name:Muscarinic acetylcholine receptor M3
Type:Enzyme
Mol. Mass.:66151.03
Organism:Homo sapiens (Human)
Description:P20309
Residue:590
BDBM50129400
NameBDBM50129400
Synonyms:(R)-1-(4-Aminomethyl-piperidin-1-yl)-2-((R)-3,3-difluoro-cyclopentyl)-2-hydroxy-2-phenyl-ethanone | CHEMBL66322
TypeSmall organic molecule
Emp. Form.C19H26F2N2O2
Mol. Mass.352.4187
SMILESNCC1CCN(CC1)C(=O)[C@@](O)([C@@H]1CCC(F)(F)C1)c1ccccc1