Reaction Details
TargetMuscarinic acetylcholine receptor M1
LigandBDBM50129393
Substrate/Competitorn/a
Meas. Tech.ChEBML_138407
Ki 4.7±n/a nM
Citation Ogino, YOhtake, NKobayashi, KKimura, TFujikawa, THasegawa, TNoguchi, KMase, T Muscarinic M(3) receptor antagonists with (2R)-2-[(1R)-3,3-difluorocyclopentyl]-2-hydroxyphenylacetamide Structures. Part 2. Bioorg Med Chem Lett13:2167-72 (2003) Muscarinic acetylcholine receptor M1
Name:Muscarinic acetylcholine receptor M1
Type:Protein
Mol. Mass.:51442.54
Organism:Homo sapiens (Human)
Description:P11229
Residue:460
BDBM50129393
NameBDBM50129393
Synonyms:(R)-1-(4-Amino-4-methyl-piperidin-1-yl)-2-((R)-3,3-difluoro-cyclopentyl)-2-hydroxy-2-phenyl-ethanone | CHEMBL68609
TypeSmall organic molecule
Emp. Form.C19H26F2N2O2
Mol. Mass.352.4187
SMILESCC1(N)CCN(CC1)C(=O)[C@@](O)([C@@H]1CCC(F)(F)C1)c1ccccc1