Reaction Details
TargetDipeptidyl peptidase 4
LigandBDBM12644
Substrate/Competitorn/a
Meas. Tech.ChEMBL_53208 (CHEMBL664029)
IC50 35±n/a nM
Citation Villhauer, EBBrinkman, JANaderi, GBBurkey, BFDunning, BEPrasad, KMangold, BLRussell, MEHughes, TE 1-[[(3-hydroxy-1-adamantyl)amino]acetyl]-2-cyano-(S)-pyrrolidine: a potent, selective, and orally bioavailable dipeptidyl peptidase IV inhibitor with antihyperglycemic properties. J Med Chem46:2774-89 (2003) 
 
Dipeptidyl peptidase 4
Name:Dipeptidyl peptidase 4
Type:Enzyme
Mol. Mass.:88271.01
Organism:Homo sapiens (Human)
Description:P27487
Residue:766
BDBM12644
NameBDBM12644
Synonyms:(2S)-1-[2-(tert-butylamino)acetyl]pyrrolidine-2-carbonitrile Cyanopyrrolidine 38
TypeSmall organic molecule
Emp. Form.C11H19N3O
Mol. Mass.209.2881
SMILESCC(C)(C)NCC(=O)N1CCC[C@H]1C#N