Reaction Details
TargetDipeptidyl peptidase 4
LigandBDBM50129898
Substrate/Competitorn/a
Meas. Tech.ChEMBL_53208 (CHEMBL664029)
IC50 10±n/a nM
Citation Villhauer, EBBrinkman, JANaderi, GBBurkey, BFDunning, BEPrasad, KMangold, BLRussell, MEHughes, TE 1-[[(3-hydroxy-1-adamantyl)amino]acetyl]-2-cyano-(S)-pyrrolidine: a potent, selective, and orally bioavailable dipeptidyl peptidase IV inhibitor with antihyperglycemic properties. J Med Chem46:2774-89 (2003) 
 
Dipeptidyl peptidase 4
Name:Dipeptidyl peptidase 4
Type:Enzyme
Mol. Mass.:88271.01
Organism:Homo sapiens (Human)
Description:P27487
Residue:766
BDBM50129898
NameBDBM50129898
Synonyms:1-{2-[4-(Benzothiazol-2-ylamino)-cyclohexylamino]-acetyl}-pyrrolidine-2-carbonitrile | CHEMBL92075
TypeSmall organic molecule
Emp. Form.C20H25N5OS
Mol. Mass.383.51
SMILESO=C(CNC1CC[C@@H](CC1)Nc1nc2ccccc2s1)N1CCC[C@H]1C#N