Reaction Details
TargetDipeptidyl peptidase 4
LigandBDBM50129915
Substrate/Competitorn/a
Meas. Tech.ChEMBL_53208 (CHEMBL664029)
IC50 26±n/a nM
Citation Villhauer, EBBrinkman, JANaderi, GBBurkey, BFDunning, BEPrasad, KMangold, BLRussell, MEHughes, TE 1-[[(3-hydroxy-1-adamantyl)amino]acetyl]-2-cyano-(S)-pyrrolidine: a potent, selective, and orally bioavailable dipeptidyl peptidase IV inhibitor with antihyperglycemic properties. J Med Chem46:2774-89 (2003) 
 
Dipeptidyl peptidase 4
Name:Dipeptidyl peptidase 4
Type:Enzyme
Mol. Mass.:88271.01
Organism:Homo sapiens (Human)
Description:P27487
Residue:766
BDBM50129915
NameBDBM50129915
Synonyms:1-[2-(1-Hydroxymethyl-cyclopentylamino)-acetyl]-pyrrolidine-2-carbonitrile | CHEMBL95088
TypeSmall organic molecule
Emp. Form.C13H21N3O2
Mol. Mass.251.3247
SMILESOCC1(CCCC1)NCC(=O)N1CCC[C@H]1C#N