Reaction Details
TargetDipeptidyl peptidase 4
LigandBDBM50129919
Substrate/Competitorn/a
Meas. Tech.ChEMBL_53208 (CHEMBL664029)
IC50 62±n/a nM
Citation Villhauer, EBBrinkman, JANaderi, GBBurkey, BFDunning, BEPrasad, KMangold, BLRussell, MEHughes, TE 1-[[(3-hydroxy-1-adamantyl)amino]acetyl]-2-cyano-(S)-pyrrolidine: a potent, selective, and orally bioavailable dipeptidyl peptidase IV inhibitor with antihyperglycemic properties. J Med Chem46:2774-89 (2003) 
 
Dipeptidyl peptidase 4
Name:Dipeptidyl peptidase 4
Type:Enzyme
Mol. Mass.:88271.01
Organism:Homo sapiens (Human)
Description:P27487
Residue:766
BDBM50129919
NameBDBM50129919
Synonyms:CHEMBL330689 | Phenyl-carbamic acid 3-[2-(2-cyano-pyrrolidin-1-yl)-2-oxo-ethylamino]-adamantan-1-yl ester
TypeSmall organic molecule
Emp. Form.C24H30N4O3
Mol. Mass.422.52
SMILESO=C(Nc1ccccc1)O[C@]12C[C@H]3C[C@H](CC(C3)(C1)NCC(=O)N1CCC[C@H]1C#N)C2