Reaction Details
TargetDipeptidyl peptidase 4
LigandBDBM50113678
Substrate/Competitorn/a
Meas. Tech.ChEMBL_53208 (CHEMBL664029)
IC50 8±n/a nM
Citation Villhauer, EBBrinkman, JANaderi, GBBurkey, BFDunning, BEPrasad, KMangold, BLRussell, MEHughes, TE 1-[[(3-hydroxy-1-adamantyl)amino]acetyl]-2-cyano-(S)-pyrrolidine: a potent, selective, and orally bioavailable dipeptidyl peptidase IV inhibitor with antihyperglycemic properties. J Med Chem46:2774-89 (2003) 
 
Dipeptidyl peptidase 4
Name:Dipeptidyl peptidase 4
Type:Enzyme
Mol. Mass.:88271.01
Organism:Homo sapiens (Human)
Description:P27487
Residue:766
BDBM50113678
NameBDBM50113678
Synonyms:1-{2-[2-(5-Nitro-pyridin-2-ylamino)-ethylamino]-acetyl}-pyrrolidine-2-carbonitrile | CHEMBL77539
TypeSmall organic molecule
Emp. Form.C14H18N6O3
Mol. Mass.318.3311
SMILES[O-][N+](=O)c1ccc(NCCNCC(=O)N2CCC[C@H]2C#N)nc1