Reaction Details
TargetDipeptidyl peptidase 4
LigandBDBM50129943
Substrate/Competitorn/a
Meas. Tech.ChEMBL_53208 (CHEMBL664029)
IC50 17±n/a nM
Citation Villhauer, EBBrinkman, JANaderi, GBBurkey, BFDunning, BEPrasad, KMangold, BLRussell, MEHughes, TE 1-[[(3-hydroxy-1-adamantyl)amino]acetyl]-2-cyano-(S)-pyrrolidine: a potent, selective, and orally bioavailable dipeptidyl peptidase IV inhibitor with antihyperglycemic properties. J Med Chem46:2774-89 (2003) 
 
Dipeptidyl peptidase 4
Name:Dipeptidyl peptidase 4
Type:Enzyme
Mol. Mass.:88271.01
Organism:Homo sapiens (Human)
Description:P27487
Residue:766
BDBM50129943
NameBDBM50129943
Synonyms:1-[2-(3,5-Dimethyl-adamantan-1-ylamino)-acetyl]-pyrrolidine-2-carbonitrile | CHEMBL96652
TypeSmall organic molecule
Emp. Form.C19H29N3O
Mol. Mass.315.4531
SMILESC[C@@]12C[C@H]3C[C@@](C)(C1)CC(C3)(C2)NCC(=O)N1CCC[C@H]1C#N