Reaction Details
TargetDipeptidyl peptidase 4
LigandBDBM50129945
Substrate/Competitorn/a
Meas. Tech.ChEMBL_53208 (CHEMBL664029)
IC50 3±n/a nM
Citation Villhauer, EBBrinkman, JANaderi, GBBurkey, BFDunning, BEPrasad, KMangold, BLRussell, MEHughes, TE 1-[[(3-hydroxy-1-adamantyl)amino]acetyl]-2-cyano-(S)-pyrrolidine: a potent, selective, and orally bioavailable dipeptidyl peptidase IV inhibitor with antihyperglycemic properties. J Med Chem46:2774-89 (2003) 
 
Dipeptidyl peptidase 4
Name:Dipeptidyl peptidase 4
Type:Enzyme
Mol. Mass.:88271.01
Organism:Homo sapiens (Human)
Description:P27487
Residue:766
BDBM50129945
NameBDBM50129945
Synonyms:1-[2-(Adamantan-1-ylamino)-acetyl]-pyrrolidine-2-carbonitrile | CHEMBL319080
TypeSmall organic molecule
Emp. Form.C17H25N3O
Mol. Mass.287.3999
SMILESO=C(CNC12C[C@H]3C[C@H](C[C@H](C3)C1)C2)N1CCC[C@H]1C#N