Reaction Details
TargetSodium-dependent serotonin transporter
LigandBDBM50130167
Substrate/Competitorn/a
Meas. Tech.ChEBML_201993
Ki 1.1±n/a nM
Citation Takeuchi, KKohn, TJHonigschmidt, NARocco, VPSpinazze, PGKoch, DJAtkinson, STHertel, LWNelson, DLWainscott, DBAhmad, LJShaw, JThrelkeld, PGWong, DT Advances Toward new antidepressants beyond SSRIs: 1-aryloxy-3-piperidinylpropan-2-ols with dual 5-HT(1A) receptor antagonism/SSRI activities. Part 2. Bioorg Med Chem Lett13:2393-7 (2003) Sodium-dependent serotonin transporter
Name:Sodium-dependent serotonin transporter
Type:Multi-pass membrane protein
Mol. Mass.:70168.43
Organism:Rattus norvegicus (rat)
Description:P31652
Residue:630
BDBM50130167
NameBDBM50130167
Synonyms:(S)-1-(1H-Indol-4-yloxy)-3-[(4S,6R)-4-(6-methoxy-benzo[b]thiophen-2-yl)-2-methyl-piperidin-1-yl]-propan-2-ol CHEMBL78405
TypeSmall organic molecule
Emp. Form.C26H30N2O3S
Mol. Mass.450.593
SMILESCOc1ccc2cc(sc2c1)[C@@H]1CCN(C[C@H](O)COc2cccc3[nH]ccc23)[C@@H](C)C1