Reaction Details
Target5-hydroxytryptamine receptor 1A
LigandBDBM50130152
Substrate/Competitorn/a
Meas. Tech.ChEBML_946
Ki 5.5±n/a nM
Citation Takeuchi, KKohn, TJHonigschmidt, NARocco, VPSpinazze, PGKoch, DJAtkinson, STHertel, LWNelson, DLWainscott, DBAhmad, LJShaw, JThrelkeld, PGWong, DT Advances Toward new antidepressants beyond SSRIs: 1-aryloxy-3-piperidinylpropan-2-ols with dual 5-HT(1A) receptor antagonism/SSRI activities. Part 2. Bioorg Med Chem Lett13:2393-7 (2003) 5-hydroxytryptamine receptor 1A
Name:5-hydroxytryptamine receptor 1A
Type:n/a
Mol. Mass.:46122.49
Organism:Homo sapiens (Human)
Description:n/a
Residue:422
BDBM50130152
NameBDBM50130152
Synonyms:(S)-1-(1H-indol-4-yloxy)-3-((2S,4R)-4-(6-fluorobenzo[b]thiophen-2-yl)-2-methylpiperidin-1-yl)propan-2-ol CHEMBL309396
TypeSmall organic molecule
Emp. Form.C25H27FN2O2S
Mol. Mass.438.557
SMILESC[C@H]1C[C@@H](CCN1C[C@H](O)COc1cccc2[nH]ccc12)c1cc2ccc(F)cc2s1